Voltage control sources
type: Concept
notation: 532
narrower: Voltage control sources - controleers and interfaces

Voltage control sources - controleers and interfaces
type: Concept
notation: 532.2
definition: Continuously varying electrical signals are passed to a loudspeaker to produce sound. The electrical signals are generated using electronic circuitry. Configurations containing analogue fully electronic devices used to produce, process and communicate electronic sound signals and/or sequences of signals. These devices use voltage control sources. Voltages are controlled by human interface devices, keyboards, foot switches, sensors, wheels or touchpads.
in scheme: Hornbostel - Sachs
broader: Voltage control sources

Hornbostel - Sachs
type: ConceptScheme