Vessel rattle drums
type: Concept
notation: 212.1
definition: Drums with single tightly stretched membranes enclosing drum bodies in the form of vessels that are curvilinear or rectilinear in profile. The membranes are indirectly struck by enclosed pellets, or similar objects, when the drum is shaken. (Unknown).
in scheme: Hornbostel - Sachs
broader: Rattle drums

Hornbostel - Sachs
type: ConceptScheme

Rattle drums
type: Concept
notation: 212
narrower: Vessel rattle drums