Sets of double-skin cylindro-conical drums
type: Concept
notation: 211.272.2
narrower: Sets of double-skin cylindro-conical drums with single playing heads

Sets of double-skin cylindro-conical drums with single playing heads
type: Concept
notation: 211.272.21
definition: Sets of drums with tubular bodies consisting of a cylindrical upper section and a conical lower section. They are enclosed at both ends by a tightly stretched membrane only one of which is directly struck by the player, using the hands or intermediate devices such as sticks.
in scheme: Hornbostel - Sachs
broader: Sets of double-skin cylindro-conical drums

Hornbostel - Sachs
type: ConceptScheme