Vessel flutes with duct
type: Concept
notation: 421.221.4
narrower: Vessel flutes with duct, without fingerholes

Vessel flutes with duct, without fingerholes
type: Concept
definition: The air itself is the vibrator in the primary sense. The standing waves are significantly confined within the instrument itself. A narrow duct directs the air stream against the sharp edge of a lateral orifice. The body of the flute is in the form of a vessel, without fingerholes. Zoomorphic pottery whistles (Europe, Asia).
notation: 421.221.41
in scheme: Hornbostel - Sachs
broader: Vessel flutes with duct

Hornbostel - Sachs
type: ConceptScheme