Gongs with divided surface
type: Concept
notation: 111.241.12
definition: Metal percussion vessels, owing to the solidity and elasticity of their substance, vibrate and radiate sound when struck with non-sonorous objects (hand, stick, striker). The struck surface of the vessel is divided to create notes of different pitches, and the vibration is strongest near the vertex of each struck section. The player creates clearly defined individual strokes. Steel drums, Caribbean.
in scheme: Hornbostel - Sachs
broader: (Individual) gongs

Hornbostel - Sachs
type: ConceptScheme

(Individual) gongs
type: Concept
notation: 111.241.1
narrower: Gongs with divided surface