Individual double-skin conical drums, both heads played
type: Concept
notation: 211.252.12
definition: An individual drum with a tubular body in which the diameter at the ends differs considerably. Tightly stretched membranes enclose the body at either end. Both membranes are directly struck by the player using the hands or intermediate devices such as sticks.
in scheme: Hornbostel - Sachs
broader: Individual double-skin conical drums

Hornbostel - Sachs
type: ConceptScheme

Individual double-skin conical drums
type: Concept
notation: 211.252.1
narrower: Individual double-skin conical drums, both heads played