Individual double-skin cylindrical drums, both heads played
type: Concept
notation: 211.212.12
definition: An individual drum with a tubular body that has the same diameter at the middle and the ends. The drum body is enclosed by a tightly stretched membrane at either end. Both membranes are directly struck by the player using the hands or intermediate devices such as sticks. Turkey davul, Europe bass drum in marching band.
in scheme: Hornbostel - Sachs
broader: Individual double-skin cylindrical drums

Hornbostel - Sachs
type: ConceptScheme

Individual double-skin cylindrical drums
type: Concept
notation: 211.212.1
narrower: Individual double-skin cylindrical drums, both heads played