Ground zithers
type: Concept
notation: 314.21
definition: A single string is stretched between fixed points. The ground is the string bearer; there is only one string. The plane of the strings is at right angles to the string bearer. Malacca, Madagascar.
in scheme: Hornbostel - Sachs
broader: Board zither variations

Hornbostel - Sachs
type: ConceptScheme

Board zither variations
type: Concept
notation: 314.2
narrower: Ground zithers