Friction drum with whirling stick
type: Concept
notation: 232.2
definition: The sound is excited by a tightly stretched membrane made to vibrate by friction. The drum is whirled on a cord which rubs on a [resined] notch in the holding stick. Waldteufel [cardboard buzzer]. Europe, India, E. Africa.
in scheme: Hornbostel - Sachs
broader: Friction drums with cord

Hornbostel - Sachs
type: ConceptScheme

Friction drums with cord
type: Concept
notation: 232
narrower: Friction drum with whirling stick