Single-skin cylindrical drums
type: Concept
notation: 211.211
narrower: Sets of single-skin cylindrical drums

Sets of single-skin cylindrical drums
type: Concept
notation: 211.211.2
definition: Sets of drums with tubular bodies that have the same diameter at the middle and the ends. Each drum body is enclosed at one end by a single tightly stretched membrane, and the opposite end is open. The membranes are directly struck by the player using the hands or intermediate devices such as sticks.
in scheme: Hornbostel - Sachs
broader: Single-skin cylindrical drums

Hornbostel - Sachs
type: ConceptScheme