Hornbostel - Sachs
type: ConceptScheme

Digital synthesizers using physical modelling techniques
type: Concept
narrower: Digital synthesizers using physical modelling techniques, with fixed keyboard controllers
notation: 541.4

Digital synthesizers using physical modelling techniques, with fixed keyboard controllers
type: Concept
broader: Digital synthesizers using physical modelling techniques
definition: Electrical signals are generated in the form of quantized sequences of pulses. These are converted to continuous signals that activate a loudspeaker. The electrical signals are generated using electronically stored data and electronic circuitry. Configurations containing devices to digitally design and process electronic sound signals and/or sequences of signals. Digital synthesizers using physical modelling techniques, with fixed keyboard controllers.
in scheme: Hornbostel - Sachs
notation: 541.42