Hornbostel - Sachs
type: ConceptScheme

Single-skin frame rattle drums
type: Concept
narrower: Single-skin frame rattle drums with membrane lapped onto a hoop
notation: 212.31

Single-skin frame rattle drums with membrane lapped onto a hoop
type: Concept
broader: Single-skin frame rattle drums
definition: Drums in which the depth of the body does not exceed the radius of the membrane. A stick forming a handle is attached to the frame in line with its diameter. The single tightly stretched membrane is indirectly struck by pendant pellets, or similar objects, when the drum is shaken. With membrane lapped onto a hoop.
in scheme: Hornbostel - Sachs
notation: 212.31-92