Hornbostel - Sachs
type: ConceptScheme

Sets of hourglass-shaped rattle drums
type: Concept
narrower: Sets of hourglass-shaped rattle drums with membrane nailed to drum
notation: 212.242

Sets of hourglass-shaped rattle drums with membrane nailed to drum
type: Concept
broader: Sets of hourglass-shaped rattle drums
definition: Sets of drums with tubular bodies that have a smaller diameter at the middle than at the ends. Tightly stretched membranes enclose each drum body at either end. The membranes are indirectly struck by pendant pellets, or similar objects, when the drum is shaken. With membrane nailed to drum.
in scheme: Hornbostel - Sachs
notation: 212.242-7