Hornbostel - Sachs
type: ConceptScheme

Individual double-skin barrel drums
type: Concept
narrower: Individual double-skin barrel drums with membrane lapped onto a hoop
notation: 211.222.1

Individual double-skin barrel drums with membrane lapped onto a hoop
type: Concept
broader: Individual double-skin barrel drums
definition: An individual drum with a barrel-shaped body, where the diameter is larger at the middle than at the ends. The drum body is enclosed by a tightly stretched membrane at either end. The membranes are directly struck by the player using the hands or intermediate devices such as sticks. With membrane lapped onto a hoop.
in scheme: Hornbostel - Sachs
notation: 211.222.1-92