Hornbostel - Sachs
type: ConceptScheme

(Separate) vessel drums with cord-and-belt bracing
type: Concept
broader: (Separate) vessel drums
definition: An individual drum with a single tightly stretched membrane enclosing a drum body in the form of a vessel that is curvilinear or rectilinear in profile. The membrane is directly struck by the player using the hands or intermediate devices such as sticks. With membrane laced to drum. Cord-and-belt bracing. The cords are laced at the lower end to a belt of different material. India.
in scheme: Hornbostel - Sachs
notation: 211.11-85

(Separate) vessel drums
type: Concept
narrower: (Separate) vessel drums with cord-and-belt bracing
notation: 211.11