Hornbostel - Sachs
type: ConceptScheme

Mechanically driven (individual) friction sticks
type: Concept
broader: (Individual) friction sticks
definition: The substance of the instrument itself, owing to its solidity and elasticity, vibrates and radiates sound. The instrument is made to vibrate by friction. The vibrating material consists of an individual vessel. Mechanically driven.
in scheme: Hornbostel - Sachs
notation: 131.1-9

(Individual) friction sticks
type: Concept
narrower: Mechanically driven (individual) friction sticks
notation: 131.1