Hornbostel - Sachs
type: ConceptScheme

Voltage control sources
type: Concept
narrower: Voltage control sources - control voltage sequence generators
notation: 532

Voltage control sources - control voltage sequence generators
type: Concept
broader: Voltage control sources
definition: Continuously varying electrical signals are passed to a loudspeaker to produce sound. The electrical signals are generated using electronic circuitry. Configurations containing analogue fully electronic devices used to produce, process and communicate electronic sound signals and/or sequences of signals. The devices use voltage control sources. Voltages are controlled by an envelope generator, a low-frequency oscillator, sequencer, slew generator, peak amplitude follower, envelope follower, or sample and hold.
in scheme: Hornbostel - Sachs
notation: 532.1