Hornbostel - Sachs
type: ConceptScheme

Double-conical rattle drums
type: Concept
narrower: Individual double-conical rattle drums
notation: 212.23

Individual double-conical rattle drums
type: Concept
broader: Double-conical rattle drums
definition: An individual drum with a tubular body that has a larger diameter at the middle than at the ends. The drum body is rectilinear, with an angular profile. Tightly stretched membranes enclose the body at either end. The membranes are indirectly struck by pendant or enclosed pellets, or similar objects, when the drum is shaken.
in scheme: Hornbostel - Sachs
notation: 212.231