Hornbostel - Sachs
type: ConceptScheme

Barrel-shaped rattle drums
type: Concept
narrower: Individual barrel-shaped rattle drums
notation: 212.22

Individual barrel-shaped rattle drums
type: Concept
broader: Barrel-shaped rattle drums
definition: An individual drum with a barrel-shaped body in which the diameter is larger at the middle than at the ends. The drum body is enclosed by a tightly stretched membrane at either end. The membranes are indirectly struck by pendant or enclosed pellets, or similar objects, when the drum is shaken.
in scheme: Hornbostel - Sachs
notation: 212.221