Hornbostel - Sachs
type: ConceptScheme

Cylindrical rattle drums
type: Concept
narrower: Individual cylindrical rattle drums
notation: 212.21

Individual cylindrical rattle drums
type: Concept
broader: Cylindrical rattle drums
definition: An individual drum with a tubular body that has the same diameter at the middle and the ends. The drum body is enclosed by a tightly stretched membrane at either end. The membranes are indirectly struck by pendant or enclosed pellets, or similar objects, when the drum is shaken.
in scheme: Hornbostel - Sachs
notation: 212.211