Hornbostel - Sachs
type: ConceptScheme

Rattle drums
type: Concept
narrower: Vessel rattle drums
notation: 212

Vessel rattle drums
type: Concept
broader: Rattle drums
definition: Drums with single tightly stretched membranes enclosing drum bodies in the form of vessels that are curvilinear or rectilinear in profile. The membranes are indirectly struck by enclosed pellets, or similar objects, when the drum is shaken. (Unknown).
in scheme: Hornbostel - Sachs
notation: 212.1