Hornbostel - Sachs
type: ConceptScheme

Sets of double-skin cylindro-conical drums
type: Concept
narrower: Sets of double-skin cylindro-conical drums, both heads played
notation: 211.272.2

Sets of double-skin cylindro-conical drums, both heads played
type: Concept
broader: Sets of double-skin cylindro-conical drums
definition: Sets of drums with tubular bodies consisting of a cylindrical upper section and a conical lower section. They are enclosed at either end by a tightly stretched membrane. Both membranes are directly struck by the player, using the hands or intermediate devices such as sticks.
in scheme: Hornbostel - Sachs
notation: 211.272.22