Hornbostel - Sachs
type: ConceptScheme

Individual double-skin cylindro-conical drums
type: Concept
narrower: Individual double-skin cylindro-conical drums, one skin used for playing
notation: 211.272.1

Individual double-skin cylindro-conical drums, one skin used for playing
type: Concept
broader: Individual double-skin cylindro-conical drums
definition: An individual drum with a tubular body consisting of a cylindrical upper section and a conical lower section. It is enclosed by a tightly stretched membrane at either end. One membrane is directly struck by the player using the hands or intermediate devices such as sticks. Uganda drum.
in scheme: Hornbostel - Sachs
notation: 211.272.11