Hornbostel - Sachs
type: ConceptScheme

Sets of double-skin double-conical drums
type: Concept
narrower: Sets of double-skin double-conical drums with single playing heads
notation: 211.232.2

Sets of double-skin double-conical drums with single playing heads
type: Concept
broader: Sets of double-skin double-conical drums
definition: Sets of drums with tubular bodies that have a larger diameter at the middle than at the ends. The drum bodies are rectilinear, with an angular profile. They are enclosed at both ends by a tightly stretched membrane only one of which is directly struck by the player, using the hands or intermediate devices such as sticks.
in scheme: Hornbostel - Sachs
notation: 211.232.21