Hornbostel - Sachs
type: ConceptScheme

Sets of double-skin barrel drums
type: Concept
narrower: Sets of double-skin barrel drums with single playing heads
notation: 211.222.2

Sets of double-skin barrel drums with single playing heads
type: Concept
broader: Sets of double-skin barrel drums
definition: Sets of drums with barrel-shaped bodies, where the diameter is larger at the middle than at the ends. Each drum body is enclosed at both ends by a tightly stretched membrane only one of which is directly struck by the player, using the hands or intermediate devices such as sticks.
in scheme: Hornbostel - Sachs
notation: 211.222.21