Hornbostel - Sachs
type: ConceptScheme

Scraped idiophones
type: Concept
narrower: Scraped vessels
notation: 112.2

Scraped vessels
type: Concept
broader: Scraped idiophones
definition: The substance of the instrument itself, owing to its solidity and elasticity, vibrates and radiates sound when scraped. The corrugated surface of a vessel is scraped. S. America, Congo region.
in scheme: Hornbostel - Sachs
notation: 112.23