Hornbostel - Sachs
type: ConceptScheme

Board zither variations
type: Concept
narrower: Ground zithers
notation: 314.2

Ground zithers
type: Concept
broader: Board zither variations
definition: A single string is stretched between fixed points. The ground is the string bearer; there is only one string. The plane of the strings is at right angles to the string bearer. Malacca, Madagascar.
in scheme: Hornbostel - Sachs
notation: 314.21