Hornbostel - Sachs
type: ConceptScheme

Stationary friction drums with friction cord
type: Concept
narrower: Single-skin stationary drums with friction cord
notation: 232.1

Single-skin stationary drums with friction cord
type: Concept
broader: Stationary friction drums with friction cord
definition: The sound is excited by a tightly stretched single membrane made to vibrate by friction when a cord, attached to the membrane is rubbed. The drum is held stationary.
in scheme: Hornbostel - Sachs
notation: 232.11