Hornbostel - Sachs
type: ConceptScheme

Friction drums with inserted stick
type: Concept
narrower: Friction drums with free stick
notation: 231.1

Friction drums with free stick
type: Concept
broader: Friction drums with inserted stick
definition: The sound is excited by a tightly stretched membrane made to vibrate by friction with a stick that passes through a hole in it. The stick can be moved freely; it is not itself rubbed, but is employed to rub the membrane. Venezuela.
in scheme: Hornbostel - Sachs
notation: 231.13